{"text_format":"1","workbook":"xlsx","n_sheets":4,"sheets":["Futtermittel","Mutter- und Milchziegen","Bocklämmermast","Mast weibl. Ziegenlämmer"],"not_rendered":{"charts":0,"images":0,"macros":1,"external_links":0,"defined_names":6,"comments":4,"pivot_tables":0},"unopened":[],"bounds":{"document_bytes":16777216,"sheet_cells":100000,"rows_first":2000,"rows_last":500,"rows_between":2000,"halvings":0,"cell_chars":16384,"cell_head_chars":4096},"cells_cut":0,"cells_raw":0,"read":"whole","date_system":"1900"}

{"sheet":"Futtermittel","index":0,"n_rows":127,"n_cols":20,"rows_kept":127,"cut":false,"hidden":false,"merged":[]}
[]
[]
[]
[]
[null,null,null,"TM","Rohprotein","nutzbares","Rohfaser","ME","Ca","P","Euro"]
[null,null,null,null,"XP","XP (nXP)","XF"]
[null,"Nr:","FUTTERMITTEL","g","g in TM","g in TM","g in TM","MJ in TM","g in TM","g in TM","€ / dt",null,null,null,null,null,null,null,null,"Nr:"]
[]
[null,null,"I. Grünfutter"]
[]
[null,null,"Grünland, 4 und mehr Nutzungen,"]
[null,null,"grasreich (untergrasbetont) "]
[null,{"$f":"IF(D13=\"\",\"\",COUNTA($D$13:D13))","v":1},"Grünland 1. Aufwuchs  Beg. Ähren-/Rispenschieben",170,224,153,206,11.47,5.9,4.4000000000000004,1.4,null,null,null,null,null,null,null,null,{"$f":"IF(D13=\"\",\"\",COUNTA($D$13:D13))","v":1}]
[null,{"$f":"IF(D14=\"\",\"\",COUNTA($D$13:D14))","v":2},"Grünland 1. Aufwuchs  volles Ähren-/Rispenschieben",180,206,150,233,10.94,6.1,3.9,1.4,null,null,null,null,null,null,null,null,{"$f":"IF(D14=\"\",\"\",COUNTA($D$13:D14))","v":2}]
[null,{"$f":"IF(D15=\"\",\"\",COUNTA($D$13:D15))","v":3},"Grünland  2. u. folg. Aufwüchse  4-6 Wochen",180,211,144,228,10.220000000000001,6.1,3.9,1.4,null,null,null,null,null,null,null,null,{"$f":"IF(D15=\"\",\"\",COUNTA($D$13:D15))","v":3}]
{"$rows_left_out":113}
{"sheet":"Mutter- und Milchziegen","index":1,"n_rows":40,"n_cols":30,"rows_kept":40,"cut":false,"hidden":false,"merged":[[9,20,10,20],[4,20,4,22],[5,20,5,22],[0,18,0,28],[2,20,2,22],[3,20,3,22],[9,21,10,21]]}
[null,null,"Landesbetrieb Landwirtschaft Hessen",null,null,null,null,null,null,null,null,null,null,null,null,null,null,null,"Rationsberechnung für Mutter- und Milchziegen"]
[null,null,"Kölnische Str. 48-50",null,null,"Rationsberechnung für Ziegen"]
[null,null,"34117 Kassel",null,null,null,null,null,null,null,null,null,null,null,null,null,null,null,null,null,"Lebendgewicht in kg:",null,null,65,null,null,"Abkürzungen.:","Umsetzbare Energie:",null,"ME in MJ"]
[null,null,null,null,null,null,null,null,null,null,null,null,null,null,null,null,null,null,null,null,"Angestrebete Milchleistung in l:",null,null,3,null,null,null,"Frischmasse:",null,"FM"]
[null,null,"Kajo Hollmichel ",null,null,null,null,null,null,null,null,null,null,null,null,null,null,null,null,null,"Angestrebte Fettprozente in %:",null,null,4,null,null,null,"Trockenmasse:",null,"TM"]
[null,null,"Tel.: 0561  7299-257",null,null,null,null,null,null,null,null,null,null,null,null,null,null,null,null,null,"Angestrebte Eiweißgehalte in %:",null,null,3.5,null,null,null,"Rohprotein:",null,"XP"]
[null,null,"mobil: 0160-4755166",null,null,null,null,null,null,null,null,null,null,null,null,null,null,null,null,null,null,null,null,null,null,null,null,"nutzbares Rohprotein:",null,"nXP"]
[null,null,"E-mail: kajo.hollmichel@llh.hessen.de"]
[]
[null,null,null,"TM (%)","Rohfaser","Rohprotein","nXP","ME","Ca","P","kg in der","TM (kg)","Rohfaser","Rohprotein","nXP","ME","Ca","P","Preis ","in der Ration","kg FM in der Ration","% TM Futter in 1 kg TM",null,"TM","Rohfaser","Roh-protein","nutzbares Rohprot.","ME","Calcium (Ca)","Phosphor (P)"]
[null,"Nr.","Futtermittel",null,"g/kg TM","g/kg TM","g/kg TM","MJ / kg TM","g/kg TM","g/kg TM","Ration",null,"g in FM","g in FM","g in FM","MJ in FM","g in FM","g in FM","€/dt","€",null,null,"Einheit","kg","g","g","g","MJ ","g","g"]
[null,{"$f":"IF($C12=\"\",\"\",VLOOKUP($C12,Futtermittel!$C$11:$T$143,18,FALSE))","v":59},"Weizen, Körner",{"$f":"IF($C12=\"\",\"\",VLOOKUP($B12,Futtermittel!$B$13:$K$130,3,FALSE))","v":880},{"$f":"IF($C12=\"\",\"\",VLOOKUP($B12,Futtermittel!$B$13:$K$130,6,FALSE))","v":29.545454545454547},{"$f":"IF($C12=\"\",\"\",VLOOKUP($B12,Futtermittel!$B$13:$K$130,4,FALSE))","v":137.5},{"$f":"IF($C12=\"\",\"\",VLOOKUP($B12,Futtermittel!$B$13:$K$130,5,FALSE))","v":171.59090909090909},{"$f":"IF($B12<1,0,VLOOKUP($B12,Futtermittel!$B$13:$K$130,7,TRUE))","v":13.375},{"$f":"IF($B12<1,0,VLOOKUP($B12,Futtermittel!$B$13:$K$130,8,TRUE))","v":0.45454545454545453},{"$f":"IF($B12<1,0,VLOOKUP($B12,Futtermittel!$B$13:$K$130,9,TRUE))","v":3.75},{"$f":"U12","v":0.4},{"$f":"IF(C12=\"\",\"\",K12*D12/1000)","v":0.35199999999999998},{"$f":"IF(C12=\"\",\"\",$K12*E12*$D12/1000)","v":10.400000000000002},{"$f":"IF(C12=\"\",\"\",$K12*F12*$D12/1000)","v":48.4},{"$f":"IF(C12=\"\",\"\",$K12*G12*$D12/1000)","v":60.4},{"$f":"IF(C12=\"\",\"\",$K12*H12*$D12/1000)","v":4.7080000000000011},{"$f":"IF(C12=\"\",\"\",$K12*I12*$D12/1000)","v":0.16},{"$f":"IF(C12=\"\",\"\",$K12*J12*$D12/1000)","v":1.32},{"$f":"IF($B12<1,0,VLOOKUP($B12,Futtermittel!$B$13:$K$130,10,TRUE))","v":20.100000000000001},{"$f":"(S12/100*K12)*SUM(Y$15:Y$24)","v":8.0400000000000013E-2},0.4,{"$f":"IF(C12=\"\",\"\",U12*(D12/1000)/U$25)","v":0.21253471802922352},"in der ges. Ration",{"$f":"SUM($L$12:$L$24)*SUM(Y15:Y24)","v":1.6562000000000001},{"$f":"SUM($M$12:$M$24)*SUM(Y15:Y24)","v":478.07},{"$f":"SUM($N$12:$N$24)*SUM(Y15:Y24)","v":177.14},{"$f":"SUM($O$12:$O$24)*SUM(Y15:Y24)","v":196.42500000000001},{"$f":"SUM($P$12:$P$24)*SUM(Y15:Y24)","v":15.43075},{"$f":"SUM($Q$12:$Q$24)*SUM(Y15:Y24)","v":9.1674999999999986},{"$f":"SUM($R$12:$R$24)*SUM(Y15:Y24)","v":4.9900000000000011}]
[null,{"$f":"IF($C13=\"\",\"\",VLOOKUP($C13,Futtermittel!$C$11:$T$143,18,FALSE))","v":1},"Grünland 1. Aufwuchs  Beg. Ähren-/Rispenschieben",{"$f":"IF($C13=\"\",\"\",VLOOKUP($B13,Futtermittel!$B$13:$K$130,3,FALSE))","v":170},{"$f":"IF($C13=\"\",\"\",VLOOKUP($B13,Futtermittel!$B$13:$K$130,6,FALSE))","v":206},{"$f":"IF($C13=\"\",\"\",VLOOKUP($B13,Futtermittel!$B$13:$K$130,4,FALSE))","v":224},{"$f":"IF($C13=\"\",\"\",VLOOKUP($B13,Futtermittel!$B$13:$K$130,5,FALSE))","v":153},{"$f":"IF($B13<1,0,VLOOKUP($B13,Futtermittel!$B$13:$K$130,7,TRUE))","v":11.47},{"$f":"IF($B13<1,0,VLOOKUP($B13,Futtermittel!$B$13:$K$130,8,TRUE))","v":5.9},{"$f":"IF($B13<1,0,VLOOKUP($B13,Futtermittel!$B$13:$K$130,9,TRUE))","v":4.4000000000000004},{"$f":"U13","v":2.5},{"$f":"IF(C13=\"\",\"\",K13*D13/1000)","v":0.42499999999999999},{"$f":"IF(C13=\"\",\"\",$K13*E13*$D13/1000)","v":87.55},{"$f":"IF(C13=\"\",\"\",$K13*F13*$D13/1000)","v":95.2},{"$f":"IF(C13=\"\",\"\",$K13*G13*$D13/1000)","v":65.025000000000006},{"$f":"IF(C13=\"\",\"\",$K13*H13*$D13/1000)","v":4.8747499999999997},{"$f":"IF(C13=\"\",\"\",$K13*I13*$D13/1000)","v":2.5074999999999998},{"$f":"IF(C13=\"\",\"\",$K13*J13*$D13/1000)","v":1.87},{"$f":"IF($B13<1,0,VLOOKUP($B13,Futtermittel!$B$13:$K$130,10,TRUE))","v":1.4},3.4999999999999996E-2,2.5,{"$f":"IF(C13=\"\",\"\",U13*(D13/1000)/U$25)","v":0.25661152034778412},"je kg TM ",null,{"$f":"Y12/$X12/1000","v":0.28865475184156503},{"$f":"Z12/$X12/1000","v":0.10695568168095639},{"$f":"AA12/$X12/1000","v":0.11859980678661998},{"$f":"AB12/X12","v":9.3169605120154557},{"$f":"AC12/$X12/1000","v":5.5352614418548475E-3},{"$f":"AD12/$X12/1000","v":3.0129211447892769E-3}]
[null,{"$f":"IF($C14=\"\",\"\",VLOOKUP($C14,Futtermittel!$C$11:$T$143,18,FALSE))","v":55},"Stroh (Gerste)",{"$f":"IF($C14=\"\",\"\",VLOOKUP($B14,Futtermittel!$B$13:$K$130,3,FALSE))","v":860},{"$f":"IF($C14=\"\",\"\",VLOOKUP($B14,Futtermittel!$B$13:$K$130,6,FALSE))","v":442},{"$f":"IF($C14=\"\",\"\",VLOOKUP($B14,Futtermittel!$B$13:$K$130,4,FALSE))","v":39},{"$f":"IF($C14=\"\",\"\",VLOOKUP($B14,Futtermittel!$B$13:$K$130,5,FALSE))","v":82.558139534883722},{"$f":"IF($B14<1,0,VLOOKUP($B14,Futtermittel!$B$13:$K$130,7,TRUE))","v":6.8},{"$f":"IF($B14<1,0,VLOOKUP($B14,Futtermittel!$B$13:$K$130,8,TRUE))","v":3.8372093023255811},{"$f":"IF($B14<1,0,VLOOKUP($B14,Futtermittel!$B$13:$K$130,9,TRUE))","v":0.93023255813953498},{"$f":"U14","v":1},{"$f":"IF(C14=\"\",\"\",K14*D14/1000)","v":0.86},{"$f":"IF(C14=\"\",\"\",$K14*E14*$D14/1000)","v":380.12},{"$f":"IF(C14=\"\",\"\",$K14*F14*$D14/1000)","v":33.54},{"$f":"IF(C14=\"\",\"\",$K14*G14*$D14/1000)","v":71},{"$f":"IF(C14=\"\",\"\",$K14*H14*$D14/1000)","v":5.8479999999999999},{"$f":"IF(C14=\"\",\"\",$K14*I14*$D14/1000)","v":3.2999999999999994},{"$f":"IF(C14=\"\",\"\",$K14*J14*$D14/1000)","v":0.80000000000000016},{"$f":"IF($B14<1,0,VLOOKUP($B14,Futtermittel!$B$13:$K$130,10,TRUE))","v":3},0.03,1,{"$f":"IF(C14=\"\",\"\",U14*(D14/1000)/U$25)","v":0.51926095882139833},"Leistungsstadium","TM-Aufn.","Gruppe","XP","XP","ME","Ca","P"]
[null,{"$f":"IF($C15=\"\",\"\",VLOOKUP($C15,Futtermittel!$C$11:$T$143,18,FALSE))","v":66},"Erbsen, Samen",{"$f":"IF($C15=\"\",\"\",VLOOKUP($B15,Futtermittel!$B$13:$K$130,3,FALSE))","v":880},{"$f":"IF($C15=\"\",\"\",VLOOKUP($B15,Futtermittel!$B$13:$K$130,6,FALSE))","v":67.045454545454547},{"$f":"IF($C15=\"\",\"\",VLOOKUP($B15,Futtermittel!$B$13:$K$130,4,FALSE))","v":251.13636363636363},{"$f":"IF($C15=\"\",\"\",VLOOKUP($B15,Futtermittel!$B$13:$K$130,5,FALSE))","v":187.5},{"$f":"IF($B15<1,0,VLOOKUP($B15,Futtermittel!$B$13:$K$130,7,TRUE))","v":13.409090909090908},{"$f":"IF($B15<1,0,VLOOKUP($B15,Futtermittel!$B$13:$K$130,8,TRUE))","v":1.0227272727272727},{"$f":"IF($B15<1,0,VLOOKUP($B15,Futtermittel!$B$13:$K$130,9,TRUE))","v":4.6590909090909092},0,0,0,0,0,0,0,0,{"$f":"IF($B15<1,0,VLOOKUP($B15,Futtermittel!$B$13:$K$130,10,TRUE))","v":31.5},0,0,0,{"$f":"C30","v":"Milchziegen"},{"$f":"D30","v":2.7},null,{"$f":"N30","v":0},0,0,0,0]
{"$rows_left_out":26}
{"sheet":"Bocklämmermast","index":2,"n_rows":42,"n_cols":30,"rows_kept":42,"cut":false,"hidden":false,"merged":[[9,20,10,20],[0,18,0,28],[9,21,10,21]]}
[null,null,"Landesbetrieb Landwirtschaft Hessen",null,null,null,null,null,null,null,null,null,null,null,null,null,null,null,"Rationsberechnung für die Bocklämmermast"]
[null,null,"Kölnische Str. 48-50",null,null,"Rationsberechnung für Ziegen"]
[null,null,"34117 Kassel",null,null,null,null,null,null,null,null,null,null,null,null,null,null,null,null,null,null,null,null,null,null,null,"Abkürzungen.:","Umsetzbare Energie:",null,"ME in MJ"]
[null,null,null,null,null,null,null,null,null,null,null,null,null,null,null,null,null,null,null,null,null,null,null,null,null,null,null,"Frischmasse:",null,"FM"]
[null,null,"Kajo Hollmichel ",null,null,null,null,null,null,null,null,null,null,null,null,null,null,null,null,null,null,null,null,null,null,null,null,"Trockenmasse:",null,"TM"]
[null,null,"Tel.: 0561  7299-257",null,null,null,null,null,null,null,null,null,null,null,null,null,null,null,null,null,null,null,null,null,null,null,null,"Rohprotein:",null,"XP"]
[null,null,"mobil: 0160-4755166",null,null,null,null,null,null,null,null,null,null,null,null,null,null,null,null,null,null,null,null,null,null,null,null,"nutzbares Rohprotein:",null,"nXP"]
[null,null,"E-mail: kajo.hollmichel@llh.hessen.de",null,null,null,null,null,null,null,null,null,null,null,null,null,null,null,null,null,null,null,null,null,null,null,null,"Tageszunahmen:",null,"TZ"]
[]
[null,null,null,"TM (%)","Rohfaser","Rohprotein","nXP","ME","Ca","P","kg in der","TM (kg)","Rohfaser","Rohprotein","nXP","ME","Ca","P","Preis ","in der Ration","kg FM in der Ration","% TM Futter in 1 kg TM",null,"TM","Rohfaser","Roh-protein","nutzbares Rohprot.","ME","Calcium (Ca)","Phosphor (P)"]
[null,"Nr.","Futtermittel",null,"g/kg TM","g/kg TM","g/kg TM","MJ / kg TM","g/kg TM","g/kg TM","Ration",null,"g in FM","g in FM","g in FM","MJ in FM","g in FM","g in FM","€/dt","€",null,null,"Einheit","kg","g","g","g","MJ ","g","g"]
[null,{"$f":"IF($C12=\"\",\"\",VLOOKUP($C12,Futtermittel!$C$11:$T$143,18,FALSE))","v":59},"Weizen, Körner",{"$f":"IF($C12=\"\",\"\",VLOOKUP($B12,Futtermittel!$B$13:$K$130,3,FALSE))","v":880},{"$f":"IF($C12=\"\",\"\",VLOOKUP($B12,Futtermittel!$B$13:$K$130,6,FALSE))","v":29.545454545454547},{"$f":"IF($C12=\"\",\"\",VLOOKUP($B12,Futtermittel!$B$13:$K$130,4,FALSE))","v":137.5},{"$f":"IF($C12=\"\",\"\",VLOOKUP($B12,Futtermittel!$B$13:$K$130,5,FALSE))","v":171.59090909090909},{"$f":"IF($B12<1,0,VLOOKUP($B12,Futtermittel!$B$13:$K$130,7,TRUE))","v":13.375},{"$f":"IF($B12<1,0,VLOOKUP($B12,Futtermittel!$B$13:$K$130,8,TRUE))","v":0.45454545454545453},{"$f":"IF($B12<1,0,VLOOKUP($B12,Futtermittel!$B$13:$K$130,9,TRUE))","v":3.75},{"$f":"U12","v":0.65},{"$f":"IF(C12=\"\",\"\",K12*D12/1000)","v":0.57199999999999995},{"$f":"IF(C12=\"\",\"\",$K12*E12*$D12/1000)","v":16.900000000000002},{"$f":"IF(C12=\"\",\"\",$K12*F12*$D12/1000)","v":78.650000000000006},{"$f":"IF(C12=\"\",\"\",$K12*G12*$D12/1000)","v":98.15000000000002},{"$f":"IF(C12=\"\",\"\",$K12*H12*$D12/1000)","v":7.6505000000000001},{"$f":"IF(C12=\"\",\"\",$K12*I12*$D12/1000)","v":0.26},{"$f":"IF(C12=\"\",\"\",$K12*J12*$D12/1000)","v":2.145},{"$f":"IF($B12<1,0,VLOOKUP($B12,Futtermittel!$B$13:$K$130,10,TRUE))","v":20.100000000000001},{"$f":"(S12/100*K12)*SUM(Y$15:Y$24)","v":0.13065000000000002},0.65,{"$f":"IF(C12=\"\",\"\",U12*(D12/1000)/U$26)","v":0.34096328087744399},"in der ges. Ration",{"$f":"SUM($L$12:$L$25)*SUM(Y15:Y25)","v":1.6776},{"$f":"SUM($M$12:$M$25)*SUM(Y15:Y25)","v":405.04399999999998},{"$f":"SUM($N$12:$N$25)*SUM(Y15:Y25)","v":196.874},{"$f":"SUM($O$12:$O$25)*SUM(Y15:Y25)","v":217.37400000000002},{"$f":"SUM($P$12:$P$25)*SUM(Y15:Y25)","v":17.008659999999999},{"$f":"SUM($Q$12:$Q$25)*SUM(Y15:Y25)","v":7.4071999999999996},{"$f":"SUM($R$12:$R$25)*SUM(Y15:Y25)","v":4.8801999999999994}]
[null,{"$f":"IF($C13=\"\",\"\",VLOOKUP($C13,Futtermittel!$C$11:$T$143,18,FALSE))","v":1},"Grünland 1. Aufwuchs  Beg. Ähren-/Rispenschieben",{"$f":"IF($C13=\"\",\"\",VLOOKUP($B13,Futtermittel!$B$13:$K$130,3,FALSE))","v":170},{"$f":"IF($C13=\"\",\"\",VLOOKUP($B13,Futtermittel!$B$13:$K$130,6,FALSE))","v":206},{"$f":"IF($C13=\"\",\"\",VLOOKUP($B13,Futtermittel!$B$13:$K$130,4,FALSE))","v":224},{"$f":"IF($C13=\"\",\"\",VLOOKUP($B13,Futtermittel!$B$13:$K$130,5,FALSE))","v":153},{"$f":"IF($B13<1,0,VLOOKUP($B13,Futtermittel!$B$13:$K$130,7,TRUE))","v":11.47},{"$f":"IF($B13<1,0,VLOOKUP($B13,Futtermittel!$B$13:$K$130,8,TRUE))","v":5.9},{"$f":"IF($B13<1,0,VLOOKUP($B13,Futtermittel!$B$13:$K$130,9,TRUE))","v":4.4000000000000004},2.4,{"$f":"IF(C13=\"\",\"\",K13*D13/1000)","v":0.40799999999999997},{"$f":"IF(C13=\"\",\"\",$K13*E13*$D13/1000)","v":84.048000000000002},{"$f":"IF(C13=\"\",\"\",$K13*F13*$D13/1000)","v":91.391999999999996},{"$f":"IF(C13=\"\",\"\",$K13*G13*$D13/1000)","v":62.423999999999999},{"$f":"IF(C13=\"\",\"\",$K13*H13*$D13/1000)","v":4.6797599999999999},{"$f":"IF(C13=\"\",\"\",$K13*I13*$D13/1000)","v":2.4072},{"$f":"IF(C13=\"\",\"\",$K13*J13*$D13/1000)","v":1.7952000000000001},{"$f":"IF($B13<1,0,VLOOKUP($B13,Futtermittel!$B$13:$K$130,10,TRUE))","v":1.4},3.3599999999999998E-2,2.4,{"$f":"IF(C13=\"\",\"\",U13*(D13/1000)/U$26)","v":0.24320457796852649},"je kg TM ",null,{"$f":"Y12/$X12/1000","v":0.24144253695755841},{"$f":"Z12/$X12/1000","v":0.11735455412494039},{"$f":"AA12/$X12/1000","v":0.12957439198855511},{"$f":"AB12/X12","v":10.138686218407248},{"$f":"AC12/$X12/1000","v":4.4153552694325224E-3},{"$f":"AD12/$X12/1000","v":2.9090367191225556E-3}]
[null,{"$f":"IF($C14=\"\",\"\",VLOOKUP($C14,Futtermittel!$C$11:$T$143,18,FALSE))","v":55},"Stroh (Gerste)",{"$f":"IF($C14=\"\",\"\",VLOOKUP($B14,Futtermittel!$B$13:$K$130,3,FALSE))","v":860},{"$f":"IF($C14=\"\",\"\",VLOOKUP($B14,Futtermittel!$B$13:$K$130,6,FALSE))","v":442},{"$f":"IF($C14=\"\",\"\",VLOOKUP($B14,Futtermittel!$B$13:$K$130,4,FALSE))","v":39},{"$f":"IF($C14=\"\",\"\",VLOOKUP($B14,Futtermittel!$B$13:$K$130,5,FALSE))","v":82.558139534883722},{"$f":"IF($B14<1,0,VLOOKUP($B14,Futtermittel!$B$13:$K$130,7,TRUE))","v":6.8},{"$f":"IF($B14<1,0,VLOOKUP($B14,Futtermittel!$B$13:$K$130,8,TRUE))","v":3.8372093023255811},{"$f":"IF($B14<1,0,VLOOKUP($B14,Futtermittel!$B$13:$K$130,9,TRUE))","v":0.93023255813953498},0.8,{"$f":"IF(C14=\"\",\"\",K14*D14/1000)","v":0.68799999999999994},{"$f":"IF(C14=\"\",\"\",$K14*E14*$D14/1000)","v":304.096},{"$f":"IF(C14=\"\",\"\",$K14*F14*$D14/1000)","v":26.832000000000004},{"$f":"IF(C14=\"\",\"\",$K14*G14*$D14/1000)","v":56.8},{"$f":"IF(C14=\"\",\"\",$K14*H14*$D14/1000)","v":4.6784000000000008},{"$f":"IF(C14=\"\",\"\",$K14*I14*$D14/1000)","v":2.64},{"$f":"IF(C14=\"\",\"\",$K14*J14*$D14/1000)","v":0.64000000000000012},{"$f":"IF($B14<1,0,VLOOKUP($B14,Futtermittel!$B$13:$K$130,10,TRUE))","v":3},2.4E-2,0.8,{"$f":"IF(C14=\"\",\"\",U14*(D14/1000)/U$26)","v":0.41010968049594665},"Leistungsstadium","TM-Aufn.","Gruppe","XP","XP","ME","Ca","P"]
[null,{"$f":"IF($C15=\"\",\"\",VLOOKUP($C15,Futtermittel!$C$11:$T$143,18,FALSE))","v":66},"Erbsen, Samen",{"$f":"IF($C15=\"\",\"\",VLOOKUP($B15,Futtermittel!$B$13:$K$130,3,FALSE))","v":880},{"$f":"IF($C15=\"\",\"\",VLOOKUP($B15,Futtermittel!$B$13:$K$130,6,FALSE))","v":67.045454545454547},{"$f":"IF($C15=\"\",\"\",VLOOKUP($B15,Futtermittel!$B$13:$K$130,4,FALSE))","v":251.13636363636363},{"$f":"IF($C15=\"\",\"\",VLOOKUP($B15,Futtermittel!$B$13:$K$130,5,FALSE))","v":187.5},{"$f":"IF($B15<1,0,VLOOKUP($B15,Futtermittel!$B$13:$K$130,7,TRUE))","v":13.409090909090908},{"$f":"IF($B15<1,0,VLOOKUP($B15,Futtermittel!$B$13:$K$130,8,TRUE))","v":1.0227272727272727},{"$f":"IF($B15<1,0,VLOOKUP($B15,Futtermittel!$B$13:$K$130,9,TRUE))","v":4.6590909090909092},0,0,0,0,0,0,0,0,{"$f":"IF($B15<1,0,VLOOKUP($B15,Futtermittel!$B$13:$K$130,10,TRUE))","v":31.5},0,null,0,{"$f":"C31","v":"Lamm 10 kg 100 g TZ"},{"$f":"D31","v":0.45},null,{"$f":"N31","v":0},0,{"$f":"P31","v":0},{"$f":"Q31","v":0},{"$f":"R31","v":0}]
{"$rows_left_out":28}
{"sheet":"Mast weibl. Ziegenlämmer","index":3,"n_rows":40,"n_cols":30,"rows_kept":40,"cut":false,"hidden":false,"merged":[[0,18,0,28],[9,20,10,20],[9,21,10,21]]}
[null,null,"Landesbetrieb Landwirtschaft Hessen",null,null,null,null,null,null,null,null,null,null,null,null,null,null,null,"Rationsberechnung für die weibliche Ziegenlämmermast"]
[null,null,"Kölnische Str. 48-50",null,null,"Rationsberechnung für Ziegen"]
[null,null,"34117 Kassel",null,null,null,null,null,null,null,null,null,null,null,null,null,null,null,null,null,null,null,null,null,null,null,"Abkürzungen.:","Umsetzbare Energie:",null,"ME in MJ"]
[null,null,null,null,null,null,null,null,null,null,null,null,null,null,null,null,null,null,null,null,null,null,null,null,null,null,null,"Frischmasse:",null,"FM"]
[null,null,"Kajo Hollmichel ",null,null,null,null,null,null,null,null,null,null,null,null,null,null,null,null,null,null,null,null,null,null,null,null,"Trockenmasse:",null,"TM"]
[null,null,"Tel.: 0561  7299-257",null,null,null,null,null,null,null,null,null,null,null,null,null,null,null,null,null,null,null,null,null,null,null,null,"Rohprotein:",null,"XP"]
[null,null,"mobil: 0160-4755166",null,null,null,null,null,null,null,null,null,null,null,null,null,null,null,null,null,null,null,null,null,null,null,null,"nutzbares Rohprotein:",null,"nXP"]
[null,null,"E-mail: kajo.hollmichel@llh.hessen.de",null,null,null,null,null,null,null,null,null,null,null,null,null,null,null,null,null,null,null,null,null,null,null,null,"Tageszunahmen:",null,"TZ"]
[]
[null,null,null,"TM (%)","Rohfaser","Rohprotein","nXP","ME","Ca","P","kg in der","TM (kg)","Rohfaser","Rohprotein","nXP","ME","Ca","P","Preis ","in der Ration","kg FM in der Ration","% TM Futter in 1 kg TM",null,"TM","Rohfaser","Roh-protein","nutzbares Rohprot.","ME","Calcium (Ca)","Phosphor (P)"]
[null,"Nr.","Futtermittel",null,"g/kg TM","g/kg TM","g/kg TM","MJ / kg TM","g/kg TM","g/kg TM","Ration",null,"g in FM","g in FM","g in FM","MJ in FM","g in FM","g in FM","€/dt","€",null,null,"Einheit","kg","g","g","g","MJ ","g","g"]
[null,{"$f":"IF($C12=\"\",\"\",VLOOKUP($C12,Futtermittel!$C$11:$T$143,18,FALSE))","v":59},"Weizen, Körner",{"$f":"IF($C12=\"\",\"\",VLOOKUP($B12,Futtermittel!$B$13:$K$130,3,FALSE))","v":880},{"$f":"IF($C12=\"\",\"\",VLOOKUP($B12,Futtermittel!$B$13:$K$130,6,FALSE))","v":29.545454545454547},{"$f":"IF($C12=\"\",\"\",VLOOKUP($B12,Futtermittel!$B$13:$K$130,4,FALSE))","v":137.5},{"$f":"IF($C12=\"\",\"\",VLOOKUP($B12,Futtermittel!$B$13:$K$130,5,FALSE))","v":171.59090909090909},{"$f":"IF($B12<1,0,VLOOKUP($B12,Futtermittel!$B$13:$K$130,7,TRUE))","v":13.375},{"$f":"IF($B12<1,0,VLOOKUP($B12,Futtermittel!$B$13:$K$130,8,TRUE))","v":0.45454545454545453},{"$f":"IF($B12<1,0,VLOOKUP($B12,Futtermittel!$B$13:$K$130,9,TRUE))","v":3.75},{"$f":"U12","v":0.8},{"$f":"IF(C12=\"\",\"\",K12*D12/1000)","v":0.70399999999999996},{"$f":"IF(C12=\"\",\"\",$K12*E12*$D12/1000)","v":20.800000000000004},{"$f":"IF(C12=\"\",\"\",$K12*F12*$D12/1000)","v":96.8},{"$f":"IF(C12=\"\",\"\",$K12*G12*$D12/1000)","v":120.8},{"$f":"IF(C12=\"\",\"\",$K12*H12*$D12/1000)","v":9.4160000000000021},{"$f":"IF(C12=\"\",\"\",$K12*I12*$D12/1000)","v":0.32},{"$f":"IF(C12=\"\",\"\",$K12*J12*$D12/1000)","v":2.64},{"$f":"IF($B12<1,0,VLOOKUP($B12,Futtermittel!$B$13:$K$130,10,TRUE))","v":20.100000000000001},{"$f":"(S12/100*K12)*SUM(Y$15:Y$24)","v":0.16080000000000003},0.8,{"$f":"IF(C12=\"\",\"\",U12*(D12/1000)/U$25)","v":0.44795113260371605},"in der ges. Ration",{"$f":"SUM($L$12:$L$24)*SUM(Y15:Y24)","v":1.5715999999999999},{"$f":"SUM($M$12:$M$24)*SUM(Y15:Y24)","v":359.916},{"$f":"SUM($N$12:$N$24)*SUM(Y15:Y24)","v":161.71199999999999},{"$f":"SUM($O$12:$O$24)*SUM(Y15:Y24)","v":203.61},{"$f":"SUM($P$12:$P$24)*SUM(Y15:Y24)","v":16.044300000000003},{"$f":"SUM($Q$12:$Q$24)*SUM(Y15:Y24)","v":6.0630000000000006},{"$f":"SUM($R$12:$R$24)*SUM(Y15:Y24)","v":4.3280000000000003}]
[null,{"$f":"IF($C13=\"\",\"\",VLOOKUP($C13,Futtermittel!$C$11:$T$143,18,FALSE))","v":1},"Grünland 1. Aufwuchs  Beg. Ähren-/Rispenschieben",{"$f":"IF($C13=\"\",\"\",VLOOKUP($B13,Futtermittel!$B$13:$K$130,3,FALSE))","v":170},{"$f":"IF($C13=\"\",\"\",VLOOKUP($B13,Futtermittel!$B$13:$K$130,6,FALSE))","v":206},{"$f":"IF($C13=\"\",\"\",VLOOKUP($B13,Futtermittel!$B$13:$K$130,4,FALSE))","v":224},{"$f":"IF($C13=\"\",\"\",VLOOKUP($B13,Futtermittel!$B$13:$K$130,5,FALSE))","v":153},{"$f":"IF($B13<1,0,VLOOKUP($B13,Futtermittel!$B$13:$K$130,7,TRUE))","v":11.47},{"$f":"IF($B13<1,0,VLOOKUP($B13,Futtermittel!$B$13:$K$130,8,TRUE))","v":5.9},{"$f":"IF($B13<1,0,VLOOKUP($B13,Futtermittel!$B$13:$K$130,9,TRUE))","v":4.4000000000000004},1,{"$f":"IF(C13=\"\",\"\",K13*D13/1000)","v":0.17},{"$f":"IF(C13=\"\",\"\",$K13*E13*$D13/1000)","v":35.020000000000003},{"$f":"IF(C13=\"\",\"\",$K13*F13*$D13/1000)","v":38.08},{"$f":"IF(C13=\"\",\"\",$K13*G13*$D13/1000)","v":26.01},{"$f":"IF(C13=\"\",\"\",$K13*H13*$D13/1000)","v":1.9499000000000002},{"$f":"IF(C13=\"\",\"\",$K13*I13*$D13/1000)","v":1.0030000000000001},{"$f":"IF(C13=\"\",\"\",$K13*J13*$D13/1000)","v":0.74800000000000011},{"$f":"IF($B13<1,0,VLOOKUP($B13,Futtermittel!$B$13:$K$130,10,TRUE))","v":1.4},1.3999999999999999E-2,1,{"$f":"IF(C13=\"\",\"\",U13*(D13/1000)/U$25)","v":0.10817001781623825},"je kg TM ",null,{"$f":"Y12/$X12/1000","v":0.22901247136676001},{"$f":"Z12/$X12/1000","v":0.10289641130058538},{"$f":"AA12/$X12/1000","v":0.12955586663273097},{"$f":"AB12/X12","v":10.208895393229833},{"$f":"AC12/$X12/1000","v":3.8578518707050144E-3},{"$f":"AD12/$X12/1000","v":2.753881394756936E-3}]
[null,{"$f":"IF($C14=\"\",\"\",VLOOKUP($C14,Futtermittel!$C$11:$T$143,18,FALSE))","v":55},"Stroh (Gerste)",{"$f":"IF($C14=\"\",\"\",VLOOKUP($B14,Futtermittel!$B$13:$K$130,3,FALSE))","v":860},{"$f":"IF($C14=\"\",\"\",VLOOKUP($B14,Futtermittel!$B$13:$K$130,6,FALSE))","v":442},{"$f":"IF($C14=\"\",\"\",VLOOKUP($B14,Futtermittel!$B$13:$K$130,4,FALSE))","v":39},{"$f":"IF($C14=\"\",\"\",VLOOKUP($B14,Futtermittel!$B$13:$K$130,5,FALSE))","v":82.558139534883722},{"$f":"IF($B14<1,0,VLOOKUP($B14,Futtermittel!$B$13:$K$130,7,TRUE))","v":6.8},{"$f":"IF($B14<1,0,VLOOKUP($B14,Futtermittel!$B$13:$K$130,8,TRUE))","v":3.8372093023255811},{"$f":"IF($B14<1,0,VLOOKUP($B14,Futtermittel!$B$13:$K$130,9,TRUE))","v":0.93023255813953498},0.8,{"$f":"IF(C14=\"\",\"\",K14*D14/1000)","v":0.68799999999999994},{"$f":"IF(C14=\"\",\"\",$K14*E14*$D14/1000)","v":304.096},{"$f":"IF(C14=\"\",\"\",$K14*F14*$D14/1000)","v":26.832000000000004},{"$f":"IF(C14=\"\",\"\",$K14*G14*$D14/1000)","v":56.8},{"$f":"IF(C14=\"\",\"\",$K14*H14*$D14/1000)","v":4.6784000000000008},{"$f":"IF(C14=\"\",\"\",$K14*I14*$D14/1000)","v":2.64},{"$f":"IF(C14=\"\",\"\",$K14*J14*$D14/1000)","v":0.64000000000000012},{"$f":"IF($B14<1,0,VLOOKUP($B14,Futtermittel!$B$13:$K$130,10,TRUE))","v":3},2.4E-2,0.8,{"$f":"IF(C14=\"\",\"\",U14*(D14/1000)/U$25)","v":0.43777042504454067},"Leistungsstadium","TM-Aufn.","Gruppe","XP","XP","ME","Ca","P"]
[null,{"$f":"IF($C15=\"\",\"\",VLOOKUP($C15,Futtermittel!$C$11:$T$143,18,FALSE))","v":66},"Erbsen, Samen",{"$f":"IF($C15=\"\",\"\",VLOOKUP($B15,Futtermittel!$B$13:$K$130,3,FALSE))","v":880},{"$f":"IF($C15=\"\",\"\",VLOOKUP($B15,Futtermittel!$B$13:$K$130,6,FALSE))","v":67.045454545454547},{"$f":"IF($C15=\"\",\"\",VLOOKUP($B15,Futtermittel!$B$13:$K$130,4,FALSE))","v":251.13636363636363},{"$f":"IF($C15=\"\",\"\",VLOOKUP($B15,Futtermittel!$B$13:$K$130,5,FALSE))","v":187.5},{"$f":"IF($B15<1,0,VLOOKUP($B15,Futtermittel!$B$13:$K$130,7,TRUE))","v":13.409090909090908},{"$f":"IF($B15<1,0,VLOOKUP($B15,Futtermittel!$B$13:$K$130,8,TRUE))","v":1.0227272727272727},{"$f":"IF($B15<1,0,VLOOKUP($B15,Futtermittel!$B$13:$K$130,9,TRUE))","v":4.6590909090909092},0,0,0,0,0,0,0,0,{"$f":"IF($B15<1,0,VLOOKUP($B15,Futtermittel!$B$13:$K$130,10,TRUE))","v":31.5},0,0,0,{"$f":"C30","v":"Lamm 10 kg 100 g TZ"},{"$f":"D30","v":0.44500000000000001},null,{"$f":"N30","v":0},0,{"$f":"P30","v":0},{"$f":"Q30","v":0},{"$f":"R30","v":0}]
{"$rows_left_out":25}