{"text_format":"1","workbook":"xlsx","n_sheets":3,"sheets":["Futtermittel","Mutter- und Milchschafe","Lämmer"],"not_rendered":{"charts":0,"images":0,"macros":1,"external_links":0,"defined_names":5,"comments":3,"pivot_tables":0},"unopened":[],"bounds":{"document_bytes":16777216,"sheet_cells":100000,"rows_first":2000,"rows_last":500,"rows_between":2000,"halvings":0,"cell_chars":16384,"cell_head_chars":4096},"cells_cut":0,"cells_raw":0,"read":"whole","date_system":"1900"}

{"sheet":"Futtermittel","index":0,"n_rows":124,"n_cols":18,"rows_kept":124,"cut":false,"hidden":false,"merged":[]}
[]
[]
[]
[]
[null,null,null,"TM","Rohprotein","Rohfaser","ME","Ca","P","Euro"]
[null,null,null,null,"XP","XF"]
[null,"Nr:","FUTTERMITTEL","g","g in TM","g in TM","MJ in TM","g in TM","g in TM","€ / dt",null,null,null,null,null,null,null,"Nr:"]
[]
[null,null,"I. Grünfutter"]
[]
[null,null,"Grünland, 4 und mehr Nutzungen,"]
[null,null,"grasreich (untergrasbetont) "]
[null,{"$f":"IF(D13=\"\",\"\",COUNTA($D$13:D13))","v":1},"Grünland 1. Aufwuchs  Beg. Ähren-/Rispenschieben",170,224,206,11.47,5.9,4.4000000000000004,1.4,null,null,null,null,null,null,null,{"$f":"IF(D13=\"\",\"\",COUNTA($D$13:D13))","v":1}]
[null,{"$f":"IF(D14=\"\",\"\",COUNTA($D$13:D14))","v":2},"Grünland 1. Aufwuchs  volles Ähren-/Rispenschieben",180,206,233,10.94,6.1,3.9,1.4,null,null,null,null,null,null,null,{"$f":"IF(D14=\"\",\"\",COUNTA($D$13:D14))","v":2}]
[null,{"$f":"IF(D15=\"\",\"\",COUNTA($D$13:D15))","v":3},"Grünland  2. u. folg. Aufwüchse  4-6 Wochen",180,211,228,10.220000000000001,6.1,3.9,1.4,null,null,null,null,null,null,null,{"$f":"IF(D15=\"\",\"\",COUNTA($D$13:D15))","v":3}]
{"$rows_left_out":110}
{"sheet":"Mutter- und Milchschafe","index":1,"n_rows":38,"n_cols":27,"rows_kept":38,"cut":false,"hidden":false,"merged":[[7,18,8,18],[4,18,4,20],[5,18,5,20],[0,16,0,26],[2,18,2,20],[3,18,3,20],[7,19,8,19]]}
[null,null,"Landesbetrieb Landwirtschaft Hessen",null,null,null,null,null,null,null,null,null,null,null,null,null,"Rationsberechnung für Mutter- und Milchschafe"]
[null,null,"Kölnische Str. 48 - 50",null,null,"Rationsberechnung für Schafe"]
[null,null,"34117 Kassel",null,null,null,null,null,null,null,null,null,null,null,null,null,null,null,"Lebendgewicht in kg:",null,null,75,null,"Abkürzungen.:","Umsetzbare Energie:",null,"ME in MJ"]
[null,null,null,null,null,null,null,null,null,null,null,null,null,null,null,null,null,null,"Angestrebete Milchleistung in l:",null,null,3,null,null,"Frischmasse",null,"FM"]
[null,null,"Dipl.-Ing. agr. Kajo Hollmichel, Tel.: 0561 7299-257",null,null,null,null,null,null,null,null,null,null,null,null,null,null,null,"Angestrebte Fettprozente in %:",null,null,6,null,null,"Trockenmasse",null,"TM"]
[null,null,"E-Mail: kajo.hollmichel@llh.hessen.de",null,null,null,null,null,null,null,null,null,null,null,null,null,null,null,"Angestrebte Eiweißgehalte in %:",null,null,5,null,null,"Rohprotein",null,"XP"]
[]
[null,null,null,"TM (%)","Rohfaser","Rohprotein","ME","Ca","P","kg in der","TM (kg)","Rohfaser","Rohprotein","ME","Ca","P","Preis ","in der Ration","kg FM in der Ration","% TM Futter in 1 kg TM",null,"TM","Rohfaser","Roh-protein","ME","Calcium (Ca)","Phosphor (P)"]
[null,"Nr.","Futtermittel",null,"g/kg TM","g/kg TM","MJ / kg TM","g/kg TM","g/kg TM","Ration",null,"g in FM","g in FM","MJ in FM","g in FM","g in FM","€/dt","€",null,null,"Einheit","kg","g","g","MJ ","g","g"]
[null,{"$f":"IF($C10=\"\",\"\",VLOOKUP($C10,Futtermittel!$C$11:$S$142,16,FALSE))","v":""},null,{"$f":"IF(C10=\"\",\"\",VLOOKUP($C10,Futtermittel!$C$13:$J$133,2,FALSE))","v":""},{"$f":"IF($C10=\"\",\"\",VLOOKUP($C10,Futtermittel!$C$13:$J$133,4,FALSE))","v":""},{"$f":"IF($C10=\"\",\"\",VLOOKUP($C10,Futtermittel!$C$13:$J$133,3,FALSE))","v":""},{"$f":"IF($C10=\"\",\"\",VLOOKUP($C10,Futtermittel!$C$13:$J$133,5,FALSE))","v":""},{"$f":"IF($C10=\"\",\"\",VLOOKUP($C10,Futtermittel!$C$13:$J$133,6,FALSE))","v":""},{"$f":"IF($C10=\"\",\"\",VLOOKUP($C10,Futtermittel!$C$13:$J$133,7,FALSE))","v":""},{"$f":"S10","v":0},{"$f":"IF(C10=\"\",\"\",J10*D10/1000)","v":""},{"$f":"IF(C10=\"\",\"\",$J10*E10*$D10/1000)","v":""},{"$f":"IF(C10=\"\",\"\",$J10*F10*$D10/1000)","v":""},{"$f":"IF(C10=\"\",\"\",$J10*G10*$D10/1000)","v":""},{"$f":"IF(C10=\"\",\"\",$J10*H10*$D10/1000)","v":""},{"$f":"IF(C10=\"\",\"\",$J10*I10*$D10/1000)","v":""},{"$f":"IF(C10=\"\",\"\",VLOOKUP($C10,Futtermittel!$C$13:$J$133,8,FALSE))","v":""},{"$f":"IF(C10=\"\",\"\",(Q10/100*J10)*SUM(W$13:W$22))","v":""},null,{"$f":"IF(C10=\"\",\"\",S10*(D10/1000)/S$23)","v":""},"in der ges. Ration",{"$f":"SUM($K$10:$K$22)*SUM(W13:W22)","v":2.1395999999999997},{"$f":"SUM($L$10:$L$22)*SUM(W13:W22)","v":655.67000000000007},{"$f":"SUM($M$10:$M$22)*SUM(W13:W22)","v":267.51400000000001},{"$f":"SUM($N$10:$N$22)*SUM(W13:W22)","v":19.746940000000002},{"$f":"SUM($O$10:$O$22)*SUM(W13:W22)","v":10.0228},{"$f":"SUM($P$10:$P$22)*SUM(W13:W22)","v":5.5198000000000009}]
[null,{"$f":"IF($C11=\"\",\"\",VLOOKUP($C11,Futtermittel!$C$11:$S$142,16,FALSE))","v":1},"Grünland 1. Aufwuchs  Beg. Ähren-/Rispenschieben",{"$f":"IF(C11=\"\",\"\",VLOOKUP($C11,Futtermittel!$C$13:$J$133,2,FALSE))","v":170},{"$f":"IF($C11=\"\",\"\",VLOOKUP($C11,Futtermittel!$C$13:$J$133,4,FALSE))","v":206},{"$f":"IF($C11=\"\",\"\",VLOOKUP($C11,Futtermittel!$C$13:$J$133,3,FALSE))","v":224},{"$f":"IF($C11=\"\",\"\",VLOOKUP($C11,Futtermittel!$C$13:$J$133,5,FALSE))","v":11.47},{"$f":"IF($C11=\"\",\"\",VLOOKUP($C11,Futtermittel!$C$13:$J$133,6,FALSE))","v":5.9},{"$f":"IF($C11=\"\",\"\",VLOOKUP($C11,Futtermittel!$C$13:$J$133,7,FALSE))","v":4.4000000000000004},{"$f":"S11","v":2.6},{"$f":"IF(C11=\"\",\"\",J11*D11/1000)","v":0.442},{"$f":"IF(C11=\"\",\"\",$J11*E11*$D11/1000)","v":91.052000000000007},{"$f":"IF(C11=\"\",\"\",$J11*F11*$D11/1000)","v":99.007999999999996},{"$f":"IF(C11=\"\",\"\",$J11*G11*$D11/1000)","v":5.0697400000000004},{"$f":"IF(C11=\"\",\"\",$J11*H11*$D11/1000)","v":2.6078000000000001},{"$f":"IF(C11=\"\",\"\",$J11*I11*$D11/1000)","v":1.9448000000000001},{"$f":"IF(C11=\"\",\"\",VLOOKUP($C11,Futtermittel!$C$13:$J$133,8,FALSE))","v":1.4},{"$f":"IF(C11=\"\",\"\",(Q11/100*J11)*SUM(W$13:W$22))","v":3.6399999999999995E-2},2.6,{"$f":"IF(C11=\"\",\"\",S11*(D11/1000)/S$23)","v":0.20658066928397836},"je kg TM ",null,{"$f":"W10/$V10/1000","v":0.30644512993082829},{"$f":"X10/$V10/1000","v":0.12502991213310902},{"$f":"Y10/V10","v":9.2292671527388315},{"$f":"Z10/$V10/1000","v":4.6844269957001311E-3},{"$f":"AA10/$V10/1000","v":2.5798280052346237E-3}]
[null,{"$f":"IF($C12=\"\",\"\",VLOOKUP($C12,Futtermittel!$C$11:$S$142,16,FALSE))","v":59},"Stroh (Gerste)",{"$f":"IF(C12=\"\",\"\",VLOOKUP($C12,Futtermittel!$C$13:$J$133,2,FALSE))","v":860},{"$f":"IF($C12=\"\",\"\",VLOOKUP($C12,Futtermittel!$C$13:$J$133,4,FALSE))","v":442},{"$f":"IF($C12=\"\",\"\",VLOOKUP($C12,Futtermittel!$C$13:$J$133,3,FALSE))","v":39},{"$f":"IF($C12=\"\",\"\",VLOOKUP($C12,Futtermittel!$C$13:$J$133,5,FALSE))","v":6.8},{"$f":"IF($C12=\"\",\"\",VLOOKUP($C12,Futtermittel!$C$13:$J$133,6,FALSE))","v":3.8372093023255811},{"$f":"IF($C12=\"\",\"\",VLOOKUP($C12,Futtermittel!$C$13:$J$133,7,FALSE))","v":0.93023255813953498},{"$f":"S12","v":1.4},1.204,532.16800000000001,46.955999999999996,8.1872000000000007,4.6199999999999992,1.1200000000000001,{"$f":"IF(C12=\"\",\"\",VLOOKUP($C12,Futtermittel!$C$13:$J$133,8,FALSE))","v":3},4.1999999999999996E-2,1.4,{"$f":"IF(C12=\"\",\"\",S12*(D12/1000)/S$23)","v":0.56272200411291839},"Leistungsstadium","TM-Aufn.","Gruppe","XP","ME","Ca","P"]
[null,{"$f":"IF($C13=\"\",\"\",VLOOKUP($C13,Futtermittel!$C$11:$S$142,16,FALSE))","v":""},null,{"$f":"IF(C13=\"\",\"\",VLOOKUP($C13,Futtermittel!$C$13:$J$133,2,FALSE))","v":""},{"$f":"IF($C13=\"\",\"\",VLOOKUP($C13,Futtermittel!$C$13:$J$133,4,FALSE))","v":""},{"$f":"IF($C13=\"\",\"\",VLOOKUP($C13,Futtermittel!$C$13:$J$133,3,FALSE))","v":""},{"$f":"IF($C13=\"\",\"\",VLOOKUP($C13,Futtermittel!$C$13:$J$133,5,FALSE))","v":""},{"$f":"IF($C13=\"\",\"\",VLOOKUP($C13,Futtermittel!$C$13:$J$133,6,FALSE))","v":""},{"$f":"IF($C13=\"\",\"\",VLOOKUP($C13,Futtermittel!$C$13:$J$133,7,FALSE))","v":""},{"$f":"S13","v":0},"","","","","","",{"$f":"IF(C13=\"\",\"\",VLOOKUP($C13,Futtermittel!$C$13:$J$133,8,FALSE))","v":""},"",null,"",{"$f":"C28","v":"Milchschaf"},{"$f":"D28","v":2.8},null,{"$f":"M28","v":0},0,0,0]
[null,{"$f":"IF($C14=\"\",\"\",VLOOKUP($C14,Futtermittel!$C$11:$S$142,16,FALSE))","v":70},"Erbsen, Samen",{"$f":"IF(C14=\"\",\"\",VLOOKUP($C14,Futtermittel!$C$13:$J$133,2,FALSE))","v":880},{"$f":"IF($C14=\"\",\"\",VLOOKUP($C14,Futtermittel!$C$13:$J$133,4,FALSE))","v":67.045454545454547},{"$f":"IF($C14=\"\",\"\",VLOOKUP($C14,Futtermittel!$C$13:$J$133,3,FALSE))","v":251.13636363636363},{"$f":"IF($C14=\"\",\"\",VLOOKUP($C14,Futtermittel!$C$13:$J$133,5,FALSE))","v":13.409090909090908},{"$f":"IF($C14=\"\",\"\",VLOOKUP($C14,Futtermittel!$C$13:$J$133,6,FALSE))","v":1.0227272727272727},{"$f":"IF($C14=\"\",\"\",VLOOKUP($C14,Futtermittel!$C$13:$J$133,7,FALSE))","v":4.6590909090909092},{"$f":"S14","v":0.55000000000000004},0.48400000000000004,32.45000000000001,121.55,6.49,0.495,2.2550000000000003,{"$f":"IF(C14=\"\",\"\",VLOOKUP($C14,Futtermittel!$C$13:$J$133,8,FALSE))","v":31.5},0.17325000000000002,0.55000000000000004,0.22621050663675457,{"$f":"C29","v":"güst, niedertragend"},{"$f":"D29","v":1.4824999999999999},null,0,0,0,0]
[null,{"$f":"IF($C15=\"\",\"\",VLOOKUP($C15,Futtermittel!$C$11:$S$142,16,FALSE))","v":76},"Mineralfutter für Mutter-und Milchschafe",{"$f":"IF(C15=\"\",\"\",VLOOKUP($C15,Futtermittel!$C$13:$J$133,2,FALSE))","v":960},{"$f":"IF($C15=\"\",\"\",VLOOKUP($C15,Futtermittel!$C$13:$J$133,4,FALSE))","v":0},{"$f":"IF($C15=\"\",\"\",VLOOKUP($C15,Futtermittel!$C$13:$J$133,3,FALSE))","v":0},{"$f":"IF($C15=\"\",\"\",VLOOKUP($C15,Futtermittel!$C$13:$J$133,5,FALSE))","v":0},{"$f":"IF($C15=\"\",\"\",VLOOKUP($C15,Futtermittel!$C$13:$J$133,6,FALSE))","v":239.58333333333334},{"$f":"IF($C15=\"\",\"\",VLOOKUP($C15,Futtermittel!$C$13:$J$133,7,FALSE))","v":20.833333333333332},0.01,9.5999999999999992E-3,0,0,0,2.2999999999999998,0.19999999999999998,{"$f":"IF(C15=\"\",\"\",VLOOKUP($C15,Futtermittel!$C$13:$J$133,8,FALSE))","v":60},6.0000000000000001E-3,0.01,4.4868199663488503E-3,"hochtragend mit",0]
{"$rows_left_out":24}
{"sheet":"Lämmer","index":2,"n_rows":38,"n_cols":27,"rows_kept":38,"cut":false,"hidden":false,"merged":[[7,18,8,18],[0,16,0,26],[7,19,8,19]]}
[null,null,"Landesbetrieb Landwirtschaft Hessen",null,null,null,null,null,null,null,null,null,null,null,null,null,"Rationsberechnung für Schafslämmer"]
[null,null,"Landwirtschaftszentrum Eichhof",null,null,"Rationsberechnung für Schafe",null,null,null,null,null,null,null,null,null,null,null,null,null,null,"Abkürzungen.:","Umsetzbare Energie",null,"ME in MJ"]
[null,null,"36251 Bad Hersfeld",null,null,null,null,null,null,null,null,null,null,null,null,null,null,null,null,null,null,"Frischmasse",null,"FM"]
[null,null,null,null,null,null,null,null,null,null,null,null,null,null,null,null,null,null,null,null,null,"Trockenmasse",null,"TM"]
[null,null,"Dr. Quanz, Tel.: 06621 9228--890",null,null,null,null,null,null,null,null,null,null,null,null,null,null,null,null,null,null,"Rohprotein",null,"XP"]
[null,null,null,null,null,null,null,null,null,null,null,null,null,null,null,null,null,null,null,null,null,"Tageszunahmen",null,"TZ"]
[]
[null,null,null,"TM (%)","Rohfaser","Rohprotein","ME","Ca","P","kg in der","TM (kg)","Rohfaser","Rohprotein","ME","Ca","P","Preis ","in der Ration","kg FM in der Ration","% TM Futter in 1 kg TM",null,"TM","Rohfaser","Roh-protein","ME","Calcium (Ca)","Phosphor (P)"]
[null,"Nr.","Futtermittel",null,"g/kg TM","g/kg TM","MJ / kg TM","g/kg TM","g/kg TM","Ration",null,"g in FM","g in FM","MJ in FM","g in FM","g in FM","€/dt","€",null,null,"Einheit","kg","g","g","MJ ","g","g"]
[null,{"$f":"IF($C10=\"\",\"\",VLOOKUP($C10,Futtermittel!$C$11:$S$142,16,FALSE))","v":""},null,{"$f":"IF(C10=\"\",\"\",VLOOKUP($C10,Futtermittel!$C$13:$J$133,2,FALSE))","v":""},{"$f":"IF($C10=\"\",\"\",VLOOKUP($C10,Futtermittel!$C$13:$J$133,4,FALSE))","v":""},{"$f":"IF($C10=\"\",\"\",VLOOKUP($C10,Futtermittel!$C$13:$J$133,3,FALSE))","v":""},{"$f":"IF($C10=\"\",\"\",VLOOKUP($C10,Futtermittel!$C$13:$J$133,5,FALSE))","v":""},{"$f":"IF($C10=\"\",\"\",VLOOKUP($C10,Futtermittel!$C$13:$J$133,6,FALSE))","v":""},{"$f":"IF($C10=\"\",\"\",VLOOKUP($C10,Futtermittel!$C$13:$J$133,7,FALSE))","v":""},{"$f":"S10","v":0},{"$f":"IF(C10=\"\",\"\",J10*D10/1000)","v":""},{"$f":"IF(C10=\"\",\"\",$J10*E10*$D10/1000)","v":""},{"$f":"IF(C10=\"\",\"\",$J10*F10*$D10/1000)","v":""},{"$f":"IF(C10=\"\",\"\",$J10*G10*$D10/1000)","v":""},{"$f":"IF(C10=\"\",\"\",$J10*H10*$D10/1000)","v":""},{"$f":"IF(C10=\"\",\"\",$J10*I10*$D10/1000)","v":""},{"$f":"IF(C10=\"\",\"\",VLOOKUP($C10,Futtermittel!$C$13:$J$133,8,FALSE))","v":""},{"$f":"IF(C10=\"\",\"\",(Q10/100*J10)*SUM(W$13:W$22))","v":""},null,{"$f":"IF(C10=\"\",\"\",S10*(D10/1000)/S$23)","v":""},"in der ges. Ration",{"$f":"SUM($K$10:$K$22)*SUM(W13:W22)","v":1.3820000000000001},{"$f":"SUM($L$10:$L$22)*SUM(W13:W22)","v":83.812000000000012},{"$f":"SUM($M$10:$M$22)*SUM(W13:W22)","v":272.24799999999999},{"$f":"SUM($N$10:$N$22)*SUM(W13:W22)","v":17.671939999999999},{"$f":"SUM($O$10:$O$22)*SUM(W13:W22)","v":14.061800000000002},{"$f":"SUM($P$10:$P$22)*SUM(W13:W22)","v":7.9588000000000001}]
[null,{"$f":"IF($C11=\"\",\"\",VLOOKUP($C11,Futtermittel!$C$11:$S$142,16,FALSE))","v":1},"Grünland 1. Aufwuchs  Beg. Ähren-/Rispenschieben",{"$f":"IF(C11=\"\",\"\",VLOOKUP($C11,Futtermittel!$C$13:$J$133,2,FALSE))","v":170},{"$f":"IF($C11=\"\",\"\",VLOOKUP($C11,Futtermittel!$C$13:$J$133,4,FALSE))","v":206},{"$f":"IF($C11=\"\",\"\",VLOOKUP($C11,Futtermittel!$C$13:$J$133,3,FALSE))","v":224},{"$f":"IF($C11=\"\",\"\",VLOOKUP($C11,Futtermittel!$C$13:$J$133,5,FALSE))","v":11.47},{"$f":"IF($C11=\"\",\"\",VLOOKUP($C11,Futtermittel!$C$13:$J$133,6,FALSE))","v":5.9},{"$f":"IF($C11=\"\",\"\",VLOOKUP($C11,Futtermittel!$C$13:$J$133,7,FALSE))","v":4.4000000000000004},{"$f":"S11","v":0.6},{"$f":"IF(C11=\"\",\"\",J11*D11/1000)","v":0.10199999999999999},{"$f":"IF(C11=\"\",\"\",$J11*E11*$D11/1000)","v":21.012},{"$f":"IF(C11=\"\",\"\",$J11*F11*$D11/1000)","v":22.847999999999999},{"$f":"IF(C11=\"\",\"\",$J11*G11*$D11/1000)","v":1.16994},{"$f":"IF(C11=\"\",\"\",$J11*H11*$D11/1000)","v":0.6018},{"$f":"IF(C11=\"\",\"\",$J11*I11*$D11/1000)","v":0.44880000000000003},{"$f":"IF(C11=\"\",\"\",VLOOKUP($C11,Futtermittel!$C$13:$J$133,8,FALSE))","v":1.4},{"$f":"IF(C11=\"\",\"\",(Q11/100*J11)*SUM(W$13:W$22))","v":8.3999999999999995E-3},0.6,{"$f":"IF(C11=\"\",\"\",S11*(D11/1000)/S$23)","v":7.3806078147612156E-2},"je kg TM ",null,{"$f":"W10/$V10/1000","v":6.0645441389290886E-2},{"$f":"X10/$V10/1000","v":0.19699565846599129},{"$f":"Y10/V10","v":12.787221418234441},{"$f":"Z10/$V10/1000","v":1.0174963820549929E-2},{"$f":"AA10/$V10/1000","v":5.7589001447178002E-3}]
[null,{"$f":"IF($C12=\"\",\"\",VLOOKUP($C12,Futtermittel!$C$11:$S$142,16,FALSE))","v":59},"Stroh (Gerste)",{"$f":"IF(C12=\"\",\"\",VLOOKUP($C12,Futtermittel!$C$13:$J$133,2,FALSE))","v":860},{"$f":"IF($C12=\"\",\"\",VLOOKUP($C12,Futtermittel!$C$13:$J$133,4,FALSE))","v":442},{"$f":"IF($C12=\"\",\"\",VLOOKUP($C12,Futtermittel!$C$13:$J$133,3,FALSE))","v":39},{"$f":"IF($C12=\"\",\"\",VLOOKUP($C12,Futtermittel!$C$13:$J$133,5,FALSE))","v":6.8},{"$f":"IF($C12=\"\",\"\",VLOOKUP($C12,Futtermittel!$C$13:$J$133,6,FALSE))","v":3.8372093023255811},{"$f":"IF($C12=\"\",\"\",VLOOKUP($C12,Futtermittel!$C$13:$J$133,7,FALSE))","v":0.93023255813953498},{"$f":"S12","v":0},0,0,0,0,0,0,{"$f":"IF(C12=\"\",\"\",VLOOKUP($C12,Futtermittel!$C$13:$J$133,8,FALSE))","v":3},0,null,{"$f":"IF(C12=\"\",\"\",S12*(D12/1000)/S$23)","v":0},"Leistungsstadium","TM-Aufn.","Gruppe","XP","ME","Ca","P"]
[null,{"$f":"IF($C13=\"\",\"\",VLOOKUP($C13,Futtermittel!$C$11:$S$142,16,FALSE))","v":63},"Weizen, Körner",{"$f":"IF(C13=\"\",\"\",VLOOKUP($C13,Futtermittel!$C$13:$J$133,2,FALSE))","v":880},{"$f":"IF($C13=\"\",\"\",VLOOKUP($C13,Futtermittel!$C$13:$J$133,4,FALSE))","v":29.545454545454547},{"$f":"IF($C13=\"\",\"\",VLOOKUP($C13,Futtermittel!$C$13:$J$133,3,FALSE))","v":137.5},{"$f":"IF($C13=\"\",\"\",VLOOKUP($C13,Futtermittel!$C$13:$J$133,5,FALSE))","v":13.375},{"$f":"IF($C13=\"\",\"\",VLOOKUP($C13,Futtermittel!$C$13:$J$133,6,FALSE))","v":0.45454545454545453},{"$f":"IF($C13=\"\",\"\",VLOOKUP($C13,Futtermittel!$C$13:$J$133,7,FALSE))","v":3.75},{"$f":"S13","v":0.6},0.52800000000000002,15.6,72.599999999999994,7.0620000000000003,0.23999999999999996,1.98,{"$f":"IF(C13=\"\",\"\",VLOOKUP($C13,Futtermittel!$C$13:$J$133,8,FALSE))","v":20.100000000000001},0.1206,0.6,0.38205499276410998,{"$f":"C28","v":"Lamm 15 kg 200 g TZ"},{"$f":"D28","v":0.5},null,{"$f":"M28","v":0},0,0,0]
[null,{"$f":"IF($C14=\"\",\"\",VLOOKUP($C14,Futtermittel!$C$11:$S$142,16,FALSE))","v":70},"Erbsen, Samen",{"$f":"IF(C14=\"\",\"\",VLOOKUP($C14,Futtermittel!$C$13:$J$133,2,FALSE))","v":880},{"$f":"IF($C14=\"\",\"\",VLOOKUP($C14,Futtermittel!$C$13:$J$133,4,FALSE))","v":67.045454545454547},{"$f":"IF($C14=\"\",\"\",VLOOKUP($C14,Futtermittel!$C$13:$J$133,3,FALSE))","v":251.13636363636363},{"$f":"IF($C14=\"\",\"\",VLOOKUP($C14,Futtermittel!$C$13:$J$133,5,FALSE))","v":13.409090909090908},{"$f":"IF($C14=\"\",\"\",VLOOKUP($C14,Futtermittel!$C$13:$J$133,6,FALSE))","v":1.0227272727272727},{"$f":"IF($C14=\"\",\"\",VLOOKUP($C14,Futtermittel!$C$13:$J$133,7,FALSE))","v":4.6590909090909092},{"$f":"S14","v":0.8},0.70399999999999996,47.2,176.8,9.44,0.72,3.28,{"$f":"IF(C14=\"\",\"\",VLOOKUP($C14,Futtermittel!$C$13:$J$133,8,FALSE))","v":31.5},0.252,0.8,0.50940665701881327,{"$f":"C29","v":"Lamm 15 kg 300 g TZ"},{"$f":"D29","v":0.8},null,0,0,0,0]
[null,{"$f":"IF($C15=\"\",\"\",VLOOKUP($C15,Futtermittel!$C$11:$S$142,16,FALSE))","v":77},"Mineralfutter (Schafsmast)",{"$f":"IF(C15=\"\",\"\",VLOOKUP($C15,Futtermittel!$C$13:$J$133,2,FALSE))","v":960},{"$f":"IF($C15=\"\",\"\",VLOOKUP($C15,Futtermittel!$C$13:$J$133,4,FALSE))","v":0},{"$f":"IF($C15=\"\",\"\",VLOOKUP($C15,Futtermittel!$C$13:$J$133,3,FALSE))","v":0},{"$f":"IF($C15=\"\",\"\",VLOOKUP($C15,Futtermittel!$C$13:$J$133,5,FALSE))","v":0},{"$f":"IF($C15=\"\",\"\",VLOOKUP($C15,Futtermittel!$C$13:$J$133,6,FALSE))","v":260.41666666666669},{"$f":"IF($C15=\"\",\"\",VLOOKUP($C15,Futtermittel!$C$13:$J$133,7,FALSE))","v":46.875},0.05,4.8000000000000001E-2,0,0,0,12.500000000000002,2.25,{"$f":"IF(C15=\"\",\"\",VLOOKUP($C15,Futtermittel!$C$13:$J$133,8,FALSE))","v":65},3.2500000000000001E-2,0.05,3.473227206946454E-2,"Lamm 25 kg 200 g TZ",0.7,null,0,0,0,0]
{"$rows_left_out":23}